hallo,
habe ktoblzcheck 1.10 und gwenhywfar 2.3.0 installiert
und habe jetzt aqbanking 2.0 mit
./configure --with-backends=aqhbci --with-frontends=cbanking
konfiguriert und dann make ausgeführt. ohne probleme.
make check gibt aber folgendes aus:
Wo ist er Fehler? Oder muss ich die Meldungen nicht beachten?
Im Anhang habe ich noch die Ausgabe von ./configure und make
Wäre super wenn mir hier jemand weiterhelfen könnte.
Vielen Dank!
Stephan
habe ktoblzcheck 1.10 und gwenhywfar 2.3.0 installiert
und habe jetzt aqbanking 2.0 mit
./configure --with-backends=aqhbci --with-frontends=cbanking
konfiguriert und dann make ausgeführt. ohne probleme.
make check gibt aber folgendes aus:
Code
# make check
make check-recursive
make[1]: Entering directory `/root/aqbanking/source/aqbanking-2.0.0'
Making check in admin
make[2]: Entering directory `/root/aqbanking/source/aqbanking-2.0.0/admin'
make[2]: Für das Ziel »check« ist nichts zu tun.
make[2]: Leaving directory `/root/aqbanking/source/aqbanking-2.0.0/admin'
Making check in doc
make[2]: Entering directory `/root/aqbanking/source/aqbanking-2.0.0/doc'
make[2]: Für das Ziel »check« ist nichts zu tun.
make[2]: Leaving directory `/root/aqbanking/source/aqbanking-2.0.0/doc'
Making check in m4
make[2]: Entering directory `/root/aqbanking/source/aqbanking-2.0.0/m4'
make[2]: Für das Ziel »check« ist nichts zu tun.
make[2]: Leaving directory `/root/aqbanking/source/aqbanking-2.0.0/m4'
Making check in src
make[2]: Entering directory `/root/aqbanking/source/aqbanking-2.0.0/src'
Making check in libs
make[3]: Entering directory `/root/aqbanking/source/aqbanking-2.0.0/src/libs'
Making check in aqbanking
make[4]: Entering directory `/root/aqbanking/source/aqbanking-2.0.0/src/libs/aqbanking'
Making check in types
make[5]: Entering directory `/root/aqbanking/source/aqbanking-2.0.0/src/libs/aqbanking/types'
make[5]: Für das Ziel »check« ist nichts zu tun.
make[5]: Leaving directory `/root/aqbanking/source/aqbanking-2.0.0/src/libs/aqbanking/types'
Making check in jobs
make[5]: Entering directory `/root/aqbanking/source/aqbanking-2.0.0/src/libs/aqbanking/jobs'
make[5]: Für das Ziel »check« ist nichts zu tun.
make[5]: Leaving directory `/root/aqbanking/source/aqbanking-2.0.0/src/libs/aqbanking/jobs'
make[5]: Entering directory `/root/aqbanking/source/aqbanking-2.0.0/src/libs/aqbanking'
make check-TESTS
make[6]: Entering directory `/root/aqbanking/source/aqbanking-2.0.0/src/libs/aqbanking'
PASS: testlib
==================
All 1 tests passed
==================
make[6]: Leaving directory `/root/aqbanking/source/aqbanking-2.0.0/src/libs/aqbanking'
make[5]: Leaving directory `/root/aqbanking/source/aqbanking-2.0.0/src/libs/aqbanking'
make[4]: Leaving directory `/root/aqbanking/source/aqbanking-2.0.0/src/libs/aqbanking'
make[4]: Entering directory `/root/aqbanking/source/aqbanking-2.0.0/src/libs'
make[4]: Für das Ziel »check-am« ist nichts zu tun.
make[4]: Leaving directory `/root/aqbanking/source/aqbanking-2.0.0/src/libs'
make[3]: Leaving directory `/root/aqbanking/source/aqbanking-2.0.0/src/libs'
Making check in frontends
make[3]: Entering directory `/root/aqbanking/source/aqbanking-2.0.0/src/frontends'
Making check in cbanking
make[4]: Entering directory `/root/aqbanking/source/aqbanking-2.0.0/src/frontends/cbanking'
make check-TESTS
make[5]: Entering directory `/root/aqbanking/source/aqbanking-2.0.0/src/frontends/cbanking'
/root/aqbanking/source/aqbanking-2.0.0/src/frontends/cbanking/.libs/lt-testlib: error while loading shared libraries: libaqbanking.so.16: cannot open shared object file: No such file or directory
FAIL: testlib
===================
1 of 1 tests failed
===================
make[5]: *** [check-TESTS] Fehler 1
make[5]: Leaving directory `/root/aqbanking/source/aqbanking-2.0.0/src/frontends/cbanking'
make[4]: *** [check-am] Fehler 2
make[4]: Leaving directory `/root/aqbanking/source/aqbanking-2.0.0/src/frontends/cbanking'
make[3]: *** [check-recursive] Fehler 1
make[3]: Leaving directory `/root/aqbanking/source/aqbanking-2.0.0/src/frontends'
make[2]: *** [check-recursive] Fehler 1
make[2]: Leaving directory `/root/aqbanking/source/aqbanking-2.0.0/src'
make[1]: *** [check-recursive] Fehler 1
make[1]: Leaving directory `/root/aqbanking/source/aqbanking-2.0.0'
make: *** [check] Fehler 2
make check-recursive
make[1]: Entering directory `/root/aqbanking/source/aqbanking-2.0.0'
Making check in admin
make[2]: Entering directory `/root/aqbanking/source/aqbanking-2.0.0/admin'
make[2]: Für das Ziel »check« ist nichts zu tun.
make[2]: Leaving directory `/root/aqbanking/source/aqbanking-2.0.0/admin'
Making check in doc
make[2]: Entering directory `/root/aqbanking/source/aqbanking-2.0.0/doc'
make[2]: Für das Ziel »check« ist nichts zu tun.
make[2]: Leaving directory `/root/aqbanking/source/aqbanking-2.0.0/doc'
Making check in m4
make[2]: Entering directory `/root/aqbanking/source/aqbanking-2.0.0/m4'
make[2]: Für das Ziel »check« ist nichts zu tun.
make[2]: Leaving directory `/root/aqbanking/source/aqbanking-2.0.0/m4'
Making check in src
make[2]: Entering directory `/root/aqbanking/source/aqbanking-2.0.0/src'
Making check in libs
make[3]: Entering directory `/root/aqbanking/source/aqbanking-2.0.0/src/libs'
Making check in aqbanking
make[4]: Entering directory `/root/aqbanking/source/aqbanking-2.0.0/src/libs/aqbanking'
Making check in types
make[5]: Entering directory `/root/aqbanking/source/aqbanking-2.0.0/src/libs/aqbanking/types'
make[5]: Für das Ziel »check« ist nichts zu tun.
make[5]: Leaving directory `/root/aqbanking/source/aqbanking-2.0.0/src/libs/aqbanking/types'
Making check in jobs
make[5]: Entering directory `/root/aqbanking/source/aqbanking-2.0.0/src/libs/aqbanking/jobs'
make[5]: Für das Ziel »check« ist nichts zu tun.
make[5]: Leaving directory `/root/aqbanking/source/aqbanking-2.0.0/src/libs/aqbanking/jobs'
make[5]: Entering directory `/root/aqbanking/source/aqbanking-2.0.0/src/libs/aqbanking'
make check-TESTS
make[6]: Entering directory `/root/aqbanking/source/aqbanking-2.0.0/src/libs/aqbanking'
PASS: testlib
==================
All 1 tests passed
==================
make[6]: Leaving directory `/root/aqbanking/source/aqbanking-2.0.0/src/libs/aqbanking'
make[5]: Leaving directory `/root/aqbanking/source/aqbanking-2.0.0/src/libs/aqbanking'
make[4]: Leaving directory `/root/aqbanking/source/aqbanking-2.0.0/src/libs/aqbanking'
make[4]: Entering directory `/root/aqbanking/source/aqbanking-2.0.0/src/libs'
make[4]: Für das Ziel »check-am« ist nichts zu tun.
make[4]: Leaving directory `/root/aqbanking/source/aqbanking-2.0.0/src/libs'
make[3]: Leaving directory `/root/aqbanking/source/aqbanking-2.0.0/src/libs'
Making check in frontends
make[3]: Entering directory `/root/aqbanking/source/aqbanking-2.0.0/src/frontends'
Making check in cbanking
make[4]: Entering directory `/root/aqbanking/source/aqbanking-2.0.0/src/frontends/cbanking'
make check-TESTS
make[5]: Entering directory `/root/aqbanking/source/aqbanking-2.0.0/src/frontends/cbanking'
/root/aqbanking/source/aqbanking-2.0.0/src/frontends/cbanking/.libs/lt-testlib: error while loading shared libraries: libaqbanking.so.16: cannot open shared object file: No such file or directory
FAIL: testlib
===================
1 of 1 tests failed
===================
make[5]: *** [check-TESTS] Fehler 1
make[5]: Leaving directory `/root/aqbanking/source/aqbanking-2.0.0/src/frontends/cbanking'
make[4]: *** [check-am] Fehler 2
make[4]: Leaving directory `/root/aqbanking/source/aqbanking-2.0.0/src/frontends/cbanking'
make[3]: *** [check-recursive] Fehler 1
make[3]: Leaving directory `/root/aqbanking/source/aqbanking-2.0.0/src/frontends'
make[2]: *** [check-recursive] Fehler 1
make[2]: Leaving directory `/root/aqbanking/source/aqbanking-2.0.0/src'
make[1]: *** [check-recursive] Fehler 1
make[1]: Leaving directory `/root/aqbanking/source/aqbanking-2.0.0'
make: *** [check] Fehler 2
Wo ist er Fehler? Oder muss ich die Meldungen nicht beachten?
Im Anhang habe ich noch die Ausgabe von ./configure und make
Wäre super wenn mir hier jemand weiterhelfen könnte.
Vielen Dank!
Stephan
Der an diesem Beitrag angefügte Anhang ist entweder nur im eingeloggten Zustand sichtbar oder die Berechtigung Deiner Benutzergruppe ist nicht ausreichend.